Reaction Details
TargetArachidonate 5-lipoxygenase-activating protein
LigandBDBM104556
Substrate/Competitorn/a
Meas. Tech.Binding Assay
IC50 3.4±0.0 nM
Citation Bartolozzi, ABosanac, TChen, ZDe Lombaert, SDines, JAHuber, JDLiu, WWLoke, PLMorwick, TMOlague, ARiether, DTye, HWu, LZindell, RM Oxadiazole inhibitors of leukotriene production US Patent US8575201 Publication Date 11/5/2013
 
Arachidonate 5-lipoxygenase-activating protein
Name:Arachidonate 5-lipoxygenase-activating protein
Type:Enzyme
Mol. Mass.:18159.90
Organism:Homo sapiens (Human)
Description:P20292
Residue:161
BDBM104556
NameBDBM104556
Synonyms:US8575201, 47
TypeSmall organic molecule
Emp. Form.C29H33N9O3
Mol. Mass.555.6308
SMILESCCOC(=O)CCN1CCN(CC1)c1ccc(cn1)-c1nc(no1)C1(CCC1)c1ccc(nc1)-c1cnc(N)nc1