Reaction Details
TargetOrexin receptor type 2
LigandBDBM104701
Substrate/Competitorn/a
Meas. Tech.Radioligand Binding Assay
Ki 0.35±0.0 nM
Citation Breslin, MJColeman, PJCox, CDSchreier, JD Pyridyl piperidine orexin receptor antagonists US Patent US8569311 Publication Date 10/29/2013
 
Orexin receptor type 2
Name:Orexin receptor type 2
Type:Protein
Mol. Mass.:52508.46
Organism:Rattus norvegicus (Rat)
Description:P56719
Residue:460
BDBM104701
NameBDBM104701
Synonyms:US8569311, 1-15
TypeSmall organic molecule
Emp. Form.C25H26FN3O2
Mol. Mass.419.4912
SMILESC[C@@H]1CC[C@@H](COc2ccc(F)cn2)CN1C(=O)c1cc(C)ccc1-c1ccccn1