Reaction Details
TargetSuppressor of tumorigenicity 14 protein
LigandBDBM104907
Substrate/Competitorn/a
Meas. Tech.Inhibition Assay
Ki 0.069±0.0 nM
Citation Steinmetzer, TSchweinitz, ADonnecke, D Meta-substituted phenyl sulfonyl amides of secondary amino acid amides, the production thereof, and use thereof as matriptase inhibitors US Patent US8569313 Publication Date 10/29/2013
 
Suppressor of tumorigenicity 14 protein
Name:Suppressor of tumorigenicity 14 protein
Type:Single-pass type II membrane protein
Mol. Mass.:94769.23
Organism:Homo sapiens (Human)
Description:Q9Y5Y6
Residue:855
BDBM104907
NameBDBM104907
Synonyms:US8569313, Inhibitor 15
TypeSmall organic molecule
Emp. Form.C28H39N7O3S
Mol. Mass.553.719
SMILESNCCC1CCN(CC1)C(=O)C(Cc1cccc(c1)C(N)=N)NS(=O)(=O)c1cccc(c1)C1CCC(N)=NC1