Reaction Details
TargetSuppressor of tumorigenicity 14 protein
LigandBDBM50254219
Substrate/Competitorn/a
Meas. Tech.Inhibition Assay
Ki 1.7±0.0 nM
Citation Steinmetzer, TSchweinitz, ADonnecke, D Meta-substituted phenyl sulfonyl amides of secondary amino acid amides, the production thereof, and use thereof as matriptase inhibitors US Patent US8569313 Publication Date 10/29/2013
 
Suppressor of tumorigenicity 14 protein
Name:Suppressor of tumorigenicity 14 protein
Type:Single-pass type II membrane protein
Mol. Mass.:94769.23
Organism:Homo sapiens (Human)
Description:Q9Y5Y6
Residue:855
BDBM50254219
NameBDBM50254219
Synonyms:Azetidine-3-carboxylic acid {3-[(S)-2-[4-(2-amino-ethyl)-piperidin-1-yl]-1-(3-carbamimidoyl-benzyl)-2-oxo-ethylsulfamoyl]-phenyl}-amide US8569313, 71
TypeSmall organic molecule
Emp. Form.C27H37N7O4S
Mol. Mass.555.692
SMILESNCCC1CCN(CC1)C(=O)[C@H](Cc1cccc(c1)C(N)=N)NS(=O)(=O)c1cccc(NC(=O)C2CNC2)c1