Reaction Details
TargetDual specificity mitogen-activated protein kinase kinase 1
LigandBDBM50132260
Substrate/Competitorn/a
Meas. Tech.Inhibition Assay
IC50 1.3e+2±n/a nM
Citation Isshiki, YKohchi, YMizuguchi, EIikura, HMatsubara, YTsujii, SShimma, NMiwa, MAida, SKohchi, MMurata, TAso, K 5-substituted-2-phenylamino benzamides as MEK inhibitors US Patent US8575391 Publication Date 11/5/2013
 
Dual specificity mitogen-activated protein kinase kinase 1
Name:Dual specificity mitogen-activated protein kinase kinase 1
Type:Other Protein Type
Mol. Mass.:43439.03
Organism:Homo sapiens (Human)
Description:Full-length human MEK-1 was generated by PCR and purified as a fusion protein from Escherichia coli lysates.
Residue:393
BDBM50132260
NameBDBM50132260
Synonyms:2-(2-Chloro-4-iodo-phenylamino)-N-cyclopropylmethoxy-3,4-difluoro-benzamide CHEMBL105442 PD-18435 US8575391, 341
TypeSmall organic molecule
Emp. Form.C17H14ClF2IN2O2
Mol. Mass.478.66
SMILESFc1ccc(C(=O)NOCC2CC2)c(Nc2ccc(I)cc2Cl)c1F