Reaction Details
TargetPolymerase acidic protein [1-204,T86I,G186S]
LigandBDBM105186
Substrate/Competitorn/a
IC50 3.00e+5±n/a nM
Citation Bauman, JDPatel, DBaker, SFVijayan, RSXiang, AParhi, AKMartínez-Sobrido, LMartínez-Sobrido, EJDas, KArnold, E Crystallographic fragment screening and structure-based optimization yields a new class of influenza endonuclease inhibitors. ACS Chem Biol8:2501-8 (2013) 
 
Polymerase acidic protein [1-204,T86I,G186S]
Name:Polymerase acidic protein [1-204,T86I,G186S]
Type:Protein
Mol. Mass.:28455.35
Organism:2009 H1N1 Influenza
Description:P13166[1-204,T86I,G186S]
Residue:241
BDBM105186
NameBDBM105186
Synonyms:isoquinoline-3-carboxylic acid (MB61-3)
TypeSmall organic molecule
Emp. Form.C10H7NO2
Mol. Mass.173.1681
SMILESOC(=O)c1cc2ccccc2cn1