Reaction Details
TargetPolymerase acidic protein [1-204,T86I,G186S]
LigandBDBM105193
Substrate/Competitorn/a
Meas. Tech.Fragment Screening
IC50 1.000e+6±n/a nM
Citation Bauman, JDPatel, DBaker, SFVijayan, RSXiang, AParhi, AKMartínez-Sobrido, LMartínez-Sobrido, EJDas, KArnold, E Crystallographic fragment screening and structure-based optimization yields a new class of influenza endonuclease inhibitors. ACS Chem Biol8:2501-8 (2013) 
 
Polymerase acidic protein [1-204,T86I,G186S]
Name:Polymerase acidic protein [1-204,T86I,G186S]
Type:Protein
Mol. Mass.:28455.35
Organism:2009 H1N1 Influenza
Description:P13166[1-204,T86I,G186S]
Residue:241
BDBM105193
NameBDBM105193
Synonyms:4‐(1H‐imidazol‐1‐yl)phenol (Compound 1) | 4-(1H-imidazol-1-yl)phenol
TypeSmall organic molecule
Emp. Form.C9H8N2O
Mol. Mass.160.1726
SMILESOc1ccc(cc1)-n1ccnc1