Reaction Details
TargetPolymerase acidic protein [1-204,T86I,G186S]
LigandBDBM105203
Substrate/Competitorn/a
Meas. Tech.Fragment Screening
IC50 11±n/a nM
Citation Bauman, JDPatel, DBaker, SFVijayan, RSXiang, AParhi, AKMartínez-Sobrido, LMartínez-Sobrido, EJDas, KArnold, E Crystallographic fragment screening and structure-based optimization yields a new class of influenza endonuclease inhibitors. ACS Chem Biol8:2501-8 (2013) 
 
Polymerase acidic protein [1-204,T86I,G186S]
Name:Polymerase acidic protein [1-204,T86I,G186S]
Type:Protein
Mol. Mass.:28455.35
Organism:2009 H1N1 Influenza
Description:P13166[1-204,T86I,G186S]
Residue:241
BDBM105203
NameBDBM105203
Synonyms:6-(4-Fluorophenyl)-3-hydroxy-5-[4-(1H-1, 2, 3, 4-tetrazol-5-yl)phenyl]-1,2-dihydropyridin-2-one (Compound 7)
TypeSmall organic molecule
Emp. Form.C18H12FN5O2
Mol. Mass.349.3186
SMILESOc1cc(-c2ccc(cc2)-c2nnn[nH]2)c([nH]c1=O)-c1ccc(F)cc1