Reaction Details
TargetSodium-dependent serotonin transporter
LigandBDBM105208
Substrate/Competitorn/a
Meas. Tech.In vitro Binding Affinity Assay
pH7.7±n/a
Temperature298.15±n/a K
Ki 80.5±7.4 nM
Commentsextracted
Citation Gabrielsen, MWolosewicz, KZawadzka, AKossakowski, JNowak, GWolak, MStachowicz, KSiwek, ARavna, AWKufareva, IKozerski, LBednarek, ESitkowski, JBocian, WAbagyan, RBojarski, AJSylte, IChilmonczyk, Z Synthesis, antidepressant evaluation and docking studies of long-chain alkylnitroquipazines as serotonin transporter inhibitors. Chem Biol Drug Des81:695-706 (2013) 
 
Sodium-dependent serotonin transporter
Name:Sodium-dependent serotonin transporter
Type:Multi-pass membrane protein
Mol. Mass.:70168.43
Organism:Rattus norvegicus (rat)
Description:P31652
Residue:630
BDBM105208
NameBDBM105208
Synonyms:2-(4-Pentyl-piperazin-1-yl)-6-nitroquinoline (5)
TypeSmall organic molecule
Emp. Form.C18H24N4O2
Mol. Mass.328.4088
SMILESCCCCCN1CCN(CC1)c1ccc2cc(ccc2n1)[N+]([O-])=O