Reaction Details
TargetPhosphatidylinositol 4,5-bisphosphate 3-kinase catalytic subunit delta isoform
LigandBDBM104486
Substrate/Competitorn/a
Meas. Tech.Biochemical Assays
IC50 12±0.0 nM
Citation Fowler, KWHuang, DKesicki, EAOoi, HCOliver, ARuan, FTreiberg, JPuri, KD 6-fluoro-3-phenyl-2-[1-(9H-purin-6-ylamino)ethyl]-3H-quinazolin-4-one as an inhibitor of human phosphatidylinositol 3-kinase delta US Patent US8586597 Publication Date 11/19/2013
 
Phosphatidylinositol 4,5-bisphosphate 3-kinase catalytic subunit delta isoform
Name:Phosphatidylinositol 4,5-bisphosphate 3-kinase catalytic subunit delta isoform
Type:Enzyme Subunit
Mol. Mass.:119489.41
Organism:Homo sapiens (Human)
Description:O00329
Residue:1044
BDBM104486
NameBDBM104486
Synonyms:US8586597, 101 | USRE44599, 117
TypeSmall organic molecule
Emp. Form.C22H16ClF2N7O
Mol. Mass.467.859
SMILESCC[C@H](Nc1ncnc2nc[nH]c12)c1nc2cccc(Cl)c2c(=O)n1-c1cc(F)cc(F)c1