Reaction Details
Target3-phosphoinositide-dependent protein kinase 1
LigandBDBM105284
Substrate/Competitorn/a
Meas. Tech.Kinase Assay
IC50 2±0.0 nM
Citation Engelhardt, HKofink, CMcConnell, D Chemical compounds US Patent US8575203 Publication Date 11/5/2013
 
3-phosphoinositide-dependent protein kinase 1
Name:3-phosphoinositide-dependent protein kinase 1
Type:Enzyme
Mol. Mass.:63157.65
Organism:Homo sapiens (Human)
Description:O15530
Residue:556
BDBM105284
NameBDBM105284
Synonyms:US8575203, I-51
TypeSmall organic molecule
Emp. Form.C31H31F2N7O2
Mol. Mass.571.6203
SMILESCCN1CCC(CC1)Nc1cnc2ccc(cc2n1)C#CCNC(=O)c1cncn([C@@H](C)c2ccc(F)c(F)c2)c1=O