Reaction Details
Target3-phosphoinositide-dependent protein kinase 1
LigandBDBM105295
Substrate/Competitorn/a
Meas. Tech.Kinase Assay
IC50 2±0.0 nM
Citation Engelhardt, HKofink, CMcConnell, D Chemical compounds US Patent US8575203 Publication Date 11/5/2013
 
3-phosphoinositide-dependent protein kinase 1
Name:3-phosphoinositide-dependent protein kinase 1
Type:Enzyme
Mol. Mass.:63157.65
Organism:Homo sapiens (Human)
Description:O15530
Residue:556
BDBM105295
NameBDBM105295
Synonyms:US8575203, I-62
TypeSmall organic molecule
Emp. Form.C37H40F2N8O2
Mol. Mass.666.7627
SMILESFc1ccc(Cn2nccc(C(=O)NCC#Cc3ccc4ncc(N[C@H]5CC[C@@H](CC5)N5CCN(CC6CC6)CC5)nc4c3)c2=O)cc1F