Reaction Details
Target3-phosphoinositide-dependent protein kinase 1
LigandBDBM105303
Substrate/Competitorn/a
Meas. Tech.Kinase Assay
IC50 1±0.0 nM
Citation Engelhardt, HKofink, CMcConnell, D Chemical compounds US Patent US8575203 Publication Date 11/5/2013
 
3-phosphoinositide-dependent protein kinase 1
Name:3-phosphoinositide-dependent protein kinase 1
Type:Enzyme
Mol. Mass.:63157.65
Organism:Homo sapiens (Human)
Description:O15530
Residue:556
BDBM105303
NameBDBM105303
Synonyms:US8575203, I-70
TypeSmall organic molecule
Emp. Form.C30H28F2N6O2
Mol. Mass.542.5791
SMILESCN1CCC(CC1)Nc1cnc2ccc(cc2c1)C#CCNC(=O)c1cncn(Cc2ccc(F)c(F)c2)c1=O