Reaction Details
Target3-phosphoinositide-dependent protein kinase 1
LigandBDBM105309
Substrate/Competitorn/a
Meas. Tech.Kinase Assay
IC50 2±0.0 nM
Citation Engelhardt, HKofink, CMcConnell, D Chemical compounds US Patent US8575203 Publication Date 11/5/2013
 
3-phosphoinositide-dependent protein kinase 1
Name:3-phosphoinositide-dependent protein kinase 1
Type:Enzyme
Mol. Mass.:63157.65
Organism:Homo sapiens (Human)
Description:O15530
Residue:556
BDBM105309
NameBDBM105309
Synonyms:US8575203, I-76
TypeSmall organic molecule
Emp. Form.C33H34FN5O3
Mol. Mass.567.6532
SMILESCCN1CCC(CC1)Nc1cnc2ccc(cc2c1)C#CCNC(=O)c1cccn([C@H](CO)c2cccc(F)c2)c1=O