Reaction Details
Target3-phosphoinositide-dependent protein kinase 1
LigandBDBM105376
Substrate/Competitorn/a
Meas. Tech.Kinase Assay
IC50 2±0.0 nM
Citation Engelhardt, HKofink, CMcConnell, D Chemical compounds US Patent US8575203 Publication Date 11/5/2013
 
3-phosphoinositide-dependent protein kinase 1
Name:3-phosphoinositide-dependent protein kinase 1
Type:Enzyme
Mol. Mass.:63157.65
Organism:Homo sapiens (Human)
Description:O15530
Residue:556
BDBM105376
NameBDBM105376
Synonyms:US8575203, I-125.18
TypeSmall organic molecule
Emp. Form.C33H31F3N4O3
Mol. Mass.588.6194
SMILESCC(c1cc(F)c(F)c(F)c1)n1cccc(C(=O)NCC#Cc2ccc3nccc(OC[C@@H]4CCCN(C)C4)c3c2)c1=O