Reaction Details
Target5-hydroxytryptamine receptor 2A
LigandBDBM106435
Substrate/Competitorn/a
Meas. Tech.Radioligand Binding Assay
Ki 1.7±0.0 nM
Citation Gobbi, LRodriguez Sarmiento, RMWichmann, J Anellated pyridine compounds US Patent US8586579 Publication Date 11/19/2013
 
5-hydroxytryptamine receptor 2A
Name:5-hydroxytryptamine receptor 2A
Type:undefined
Mol. Mass.:52607.65
Organism:Homo sapiens (Human)
Description:P28223
Residue:471
BDBM106435
NameBDBM106435
Synonyms:US8586579, 24
TypeSmall organic molecule
Emp. Form.C25H36N4O2S
Mol. Mass.456.644
SMILESO=C(N[C@H]1CC[C@H](CCN2CCN(CC2)c2nccc3sccc23)CC1)C1CCOCC1