Reaction Details
TargetMicrotubule-associated protein tau
LigandBDBM281555
Substrate/Competitorn/a
Meas. Tech.Tau binding assay
pH7.4±n/a
Temperature298.15±n/a K
Ki 0.540±n/a nM
Commentsextracted
Citation Walji, AMHostetler, EGreshock, TJLi, JMoore, KPBennacef, IMulhearn, JSelnick, HWang, YYang, KFu, J Pyrrolo[2,3-C]pyridines as imaging agents for neurofibrilary tangles US Patent US10022461 Publication Date 7/17/2018
 
Microtubule-associated protein tau
Name:Microtubule-associated protein tau
Type:Protein
Mol. Mass.:78928.63
Organism:Homo sapiens (Human)
Description:P10636
Residue:758
BDBM281555
NameBDBM281555
Synonyms:US10022461, Compound 6
TypeSmall organic molecule
Emp. Form.C16H11N3
Mol. Mass.245.2786
SMILESc1cc2ccncc2n1-c1cc2ccccc2cn1