Reaction Details
TargetMicrotubule-associated protein tau
LigandBDBM281606
Substrate/Competitorn/a
Meas. Tech.Tau binding assay
pH7.4±n/a
Temperature298.15±n/a K
Ki 1.16±n/a nM
Commentsextracted
Citation Walji, AMHostetler, EGreshock, TJLi, JMoore, KPBennacef, IMulhearn, JSelnick, HWang, YYang, KFu, J Pyrrolo[2,3-C]pyridines as imaging agents for neurofibrilary tangles US Patent US10022461 Publication Date 7/17/2018
 
Microtubule-associated protein tau
Name:Microtubule-associated protein tau
Type:Protein
Mol. Mass.:78928.63
Organism:Homo sapiens (Human)
Description:P10636
Residue:758
BDBM281606
NameBDBM281606
Synonyms:US10022461, Compound 56
TypeSmall organic molecule
Emp. Form.C16H11N3O
Mol. Mass.261.278
SMILESOc1cccc2cc(ncc12)-n1ccc2ccncc12