Reaction Details
TargetPlatelet-derived growth factor receptor alpha
LigandBDBM106560
Substrate/Competitorn/a
Meas. Tech.Inhibition Assay (PDGFR)
IC50 1.4±0.0 nM
Citation Singh, JGhosh, SKluge, AFPetter, RC Heterocyclic compounds and uses thereof US Patent US8586600 Publication Date 11/19/2013
 
Platelet-derived growth factor receptor alpha
Name:Platelet-derived growth factor receptor alpha
Type:Protein
Mol. Mass.:122633.38
Organism:Homo sapiens (Human)
Description:P16234
Residue:1089
BDBM106560
NameBDBM106560
Synonyms:US8586600, II-55
TypeSmall organic molecule
Emp. Form.C30H28F3N7O2
Mol. Mass.575.5842
SMILESCN(C)C\C=C\C(=O)Nc1ccc(cc1C(F)(F)F)C(=O)Nc1ccc(C)c(Nc2nccc(n2)-c2cccnc2)c1