Reaction Details
TargetRetinol-binding protein 4
LigandBDBM106688
Substrate/Competitorn/a
Meas. Tech.Binding Assay
IC50 20±0.0 nM
Citation Kasai, SKaku, TKamaura, M Heterocyclic compound US Patent US8586571 Publication Date 11/19/2013
 
Retinol-binding protein 4
Name:Retinol-binding protein 4
Type:Protein
Mol. Mass.:23008.75
Organism:Homo sapiens (Human)
Description:P02753
Residue:201
BDBM106688
NameBDBM106688
Synonyms:US8586571, 80
TypeSmall organic molecule
Emp. Form.C17H22FNO4
Mol. Mass.323.3593
SMILESCC(C)(C)c1cc(F)ccc1OC1CN(C1)C(=O)CCC(O)=O