Reaction Details
TargetPolyunsaturated fatty acid lipoxygenase ALOX12
LigandBDBM106775
Substrate/Competitorn/a
Meas. Tech.IC50 Assay
pH8±0
Temperature296.15±0 K
IC50 1.3e+4±n/a nM
Citation Mascayano, CEspinosa, VSepúlveda-Boza, SSepúlveda-Boza, EKPerry, S In vitro study of isoflavones and isoflavans as potent inhibitors of human 12- and 15-lipoxygenases. Chem Biol Drug Des82:317-25 (2013) 
 
Polyunsaturated fatty acid lipoxygenase ALOX12
Name:Polyunsaturated fatty acid lipoxygenase ALOX12
Type:Protein
Mol. Mass.:75689.18
Organism:Homo sapiens (Human)
Description:P18054
Residue:663
BDBM106775
NameBDBM106775
Synonyms:6,7‐dihydroxy‐3‐(4‐nitrophenyl)‐4H‐chromen‐4‐one IR-6
TypeSmall organic molecule
Emp. Form.C15H9NO6
Mol. Mass.299.2351
SMILESOc1cc2occ(-c3ccc(cc3)[N+]([O-])=O)c(=O)c2cc1O