Reaction Details
TargetPolyunsaturated fatty acid lipoxygenase ALOX15
LigandBDBM106776
Substrate/Competitorn/a
Meas. Tech.IC50 Assay
pH7.5±0
Temperature296.15±0 K
IC50 5.9e+2±n/a nM
Citation Mascayano, CEspinosa, VSepúlveda-Boza, SSepúlveda-Boza, EKPerry, S In vitro study of isoflavones and isoflavans as potent inhibitors of human 12- and 15-lipoxygenases. Chem Biol Drug Des82:317-25 (2013) 
 
Polyunsaturated fatty acid lipoxygenase ALOX15
Name:Polyunsaturated fatty acid lipoxygenase ALOX15
Type:Protein
Mol. Mass.:74804.05
Organism:Homo sapiens (Human)
Description:n/a
Residue:662
BDBM106776
NameBDBM106776
Synonyms:3‐(3‐chlorophenyl)‐6,7‐dihydroxy‐4H‐chromen‐4‐one IR-8
TypeSmall organic molecule
Emp. Form.C15H9ClO4
Mol. Mass.288.683
SMILESOc1cc2occ(-c3cccc(Cl)c3)c(=O)c2cc1O