Reaction Details
TargetThioredoxin reductase
LigandBDBM106944
Substrate/Competitorn/a
Meas. Tech.Inhibition Assay
Ki 1.0e+3±n/a nM
IC50 1.5e+4±n/a nM
Citation Holmgren, ALu, JVlamis-Gardikas, AZhao, RKandasamy, KEngman, LEngstrand, LHoffner, S Bacterial thioredoxin reductase inhibitors and methods for use thereof US Patent US8592468 Publication Date 11/26/2013
 
Thioredoxin reductase
Name:Thioredoxin reductase
Type:Protein
Mol. Mass.:34615.59
Organism:Escherichia coli (strain K12)
Description:P0A9P4
Residue:321
BDBM106944
NameBDBM106944
Synonyms:US8592468, EbSe2
TypeSmall organic molecule
Emp. Form.C7H5NOSe
Mol. Mass.198.08
SMILESO=c1[nH][se]c2ccccc12