Reaction Details
TargetThioredoxin reductase
LigandBDBM106948
Substrate/Competitorn/a
Meas. Tech.Inhibition Assay
Ki 2.5e+2±n/a nM
IC50 3e+3±n/a nM
Citation Holmgren, ALu, JVlamis-Gardikas, AZhao, RKandasamy, KEngman, LEngstrand, LHoffner, S Bacterial thioredoxin reductase inhibitors and methods for use thereof US Patent US8592468 Publication Date 11/26/2013
 
Thioredoxin reductase
Name:Thioredoxin reductase
Type:Protein
Mol. Mass.:34615.59
Organism:Escherichia coli (strain K12)
Description:P0A9P4
Residue:321
BDBM106948
NameBDBM106948
Synonyms:US8592468, EbSe12
TypeSmall organic molecule
Emp. Form.C12H7N3O3Se
Mol. Mass.320.16
SMILES[O-][N+](=O)c1cccnc1-n1[se]c2ccccc2c1=O