Reaction Details
TargetThioredoxin reductase
LigandBDBM50385299
Substrate/Competitorn/a
Meas. Tech.Inhibition Assay
Ki 1e+1±n/a nM
IC50 2.25e+3±n/a nM
Citation Holmgren, ALu, JVlamis-Gardikas, AZhao, RKandasamy, KEngman, LEngstrand, LHoffner, S Bacterial thioredoxin reductase inhibitors and methods for use thereof US Patent US8592468 Publication Date 11/26/2013
 
Thioredoxin reductase
Name:Thioredoxin reductase
Type:Protein
Mol. Mass.:34615.59
Organism:Escherichia coli (strain K12)
Description:P0A9P4
Residue:321
BDBM50385299
NameBDBM50385299
Synonyms:CHEMBL2035464 | US8592468, EbSe16
TypeSmall organic molecule
Emp. Form.C20H20N2O2Se2
Mol. Mass.478.3
SMILESO=c1n(CCCCCCn2[se]c3ccccc3c2=O)[se]c2ccccc12