Reaction Details
TargetOrexin receptor type 2
LigandBDBM106968
Substrate/Competitorn/a
Meas. Tech.FLIPR Ca2+ Flux Assay
pH7.4±0
Temperature310.15±0 K
Ki 0.72±0.0 nM
Citation Bergman, JMColeman, PJMattern, MCMercer, SPReger, TSRoecker, AJ Isonicotinamide orexin receptor antagonists US Patent US8592457 Publication Date 11/26/2013
 
Orexin receptor type 2
Name:Orexin receptor type 2
Type:Protein
Mol. Mass.:50710.53
Organism:Homo sapiens (Human)
Description:O43614
Residue:444
BDBM106968
NameBDBM106968
Synonyms:US8592457, 1-5
TypeSmall organic molecule
Emp. Form.C26H24N4O3
Mol. Mass.440.4938
SMILESCOc1ccc(CNC(=O)c2cc(ncc2-c2ccccc2)-c2cncc(C)c2)nc1OC