Reaction Details
TargetOrexin receptor type 2
LigandBDBM106972
Substrate/Competitorn/a
Meas. Tech.FLIPR Ca2+ Flux Assay
pH7.4±0
Temperature310.15±0 K
Ki 0.97±0.0 nM
Citation Bergman, JMColeman, PJMattern, MCMercer, SPReger, TSRoecker, AJ Isonicotinamide orexin receptor antagonists US Patent US8592457 Publication Date 11/26/2013
 
Orexin receptor type 2
Name:Orexin receptor type 2
Type:Protein
Mol. Mass.:50710.53
Organism:Homo sapiens (Human)
Description:O43614
Residue:444
BDBM106972
NameBDBM106972
Synonyms:US8592457, 7-7
TypeSmall organic molecule
Emp. Form.C25H23N5O2S
Mol. Mass.457.547
SMILESCOc1nc(CNC(=O)c2cc(ncc2-c2nccs2)-c2cncc(C)c2)ccc1C1CC1