Reaction Details
TargetALK tyrosine kinase receptor
LigandBDBM50436855
Substrate/Competitorn/a
Meas. Tech.Enzyme Assay
IC50 26±n/a nM
Citation Chen, BJiang, TMarsilje, THMichellys, PNguyen, TNPei, WWu, BGao, ZGe, YHuang, CLi, YZhu, X Compounds and compositions as protein kinase inhibitors US Patent US8592432 Publication Date 11/26/2013
 
ALK tyrosine kinase receptor
Name:ALK tyrosine kinase receptor
Type:Protein
Mol. Mass.:176453.10
Organism:Homo sapiens (Human)
Description:Q9UM73
Residue:1620
BDBM50436855
NameBDBM50436855
Synonyms:CHEMBL2403842 | US8592432, 1
TypeSmall organic molecule
Emp. Form.C32H43ClN6O4S
Mol. Mass.643.24
SMILESCC(C)Oc1cc(C2CCN(CC2)C(=O)CN(C)C)c(C)cc1Nc1ncc(Cl)c(Nc2ccccc2S(=O)(=O)C(C)C)n1