Reaction Details
TargetALK tyrosine kinase receptor
LigandBDBM107042
Substrate/Competitorn/a
Meas. Tech.Enzyme Assay
IC50 12±n/a nM
Citation Chen, BJiang, TMarsilje, THMichellys, PNguyen, TNPei, WWu, BGao, ZGe, YHuang, CLi, YZhu, X Compounds and compositions as protein kinase inhibitors US Patent US8592432 Publication Date 11/26/2013
 
ALK tyrosine kinase receptor
Name:ALK tyrosine kinase receptor
Type:Protein
Mol. Mass.:176453.10
Organism:Homo sapiens (Human)
Description:Q9UM73
Residue:1620
BDBM107042
NameBDBM107042
Synonyms:US8592432, 17
TypeSmall organic molecule
Emp. Form.C34H42ClN7O5S
Mol. Mass.696.259
SMILESCC(C)Oc1cc2CN(C3CCN(CC3)C(=O)C3CN(C)C3)C(=O)c2cc1Nc1ncc(Cl)c(Nc2ccccc2S(=O)(=O)C(C)C)n1