Reaction Details
TargetALK tyrosine kinase receptor
LigandBDBM107080
Substrate/Competitorn/a
Meas. Tech.Enzyme Assay
IC50 46±n/a nM
Citation Chen, BJiang, TMarsilje, THMichellys, PNguyen, TNPei, WWu, BGao, ZGe, YHuang, CLi, YZhu, X Compounds and compositions as protein kinase inhibitors US Patent US8592432 Publication Date 11/26/2013
 
ALK tyrosine kinase receptor
Name:ALK tyrosine kinase receptor
Type:Protein
Mol. Mass.:176453.10
Organism:Homo sapiens (Human)
Description:Q9UM73
Residue:1620
BDBM107080
NameBDBM107080
Synonyms:US8592432, 66
TypeSmall organic molecule
Emp. Form.C36H48N8O4S
Mol. Mass.688.883
SMILESCC(C)Oc1cc(C2CCN(CC2)C(=O)CCN2CCC2)c(C)cc1Nc1nc(Nc2ccccc2S(=O)(=O)C(C)C)c2c(C)[nH]nc2n1