Reaction Details
TargetKininogen-1
LigandBDBM107167
Substrate/Competitorn/a
Meas. Tech.Calcium Mobilization Assay
IC50 0.5±n/a nM
Citation Aebi, JBinggeli, AHertel, CKonkar, AAKuehne, HKuhn, BMaerki, HPWang, H Aryl-benzocycloalkyl amide derivatives US Patent US8592426 Publication Date 11/26/2013
 
Kininogen-1
Name:Kininogen-1
Type:Enzyme
Mol. Mass.:71962.11
Organism:Homo sapiens (Human)
Description:P01042
Residue:644
BDBM107167
NameBDBM107167
Synonyms:US8592426, 16
TypeSmall organic molecule
Emp. Form.C24H18ClF5N4O3
Mol. Mass.540.87
SMILESCc1nc(no1)-c1c(F)cc(Cl)cc1-c1cc2CCC(NC(=O)C3(CC3)NC(=O)C(F)(F)F)c2c(F)c1