Reaction Details
TargetKininogen-1
LigandBDBM107197
Substrate/Competitorn/a
Meas. Tech.Calcium Mobilization Assay
IC50 0.2±n/a nM
Citation Aebi, JBinggeli, AHertel, CKonkar, AAKuehne, HKuhn, BMaerki, HPWang, H Aryl-benzocycloalkyl amide derivatives US Patent US8592426 Publication Date 11/26/2013
 
Kininogen-1
Name:Kininogen-1
Type:Enzyme
Mol. Mass.:71962.11
Organism:Homo sapiens (Human)
Description:P01042
Residue:644
BDBM107197
NameBDBM107197
Synonyms:US8592426, 47
TypeSmall organic molecule
Emp. Form.C27H22ClFN6O5
Mol. Mass.564.952
SMILESCOc1ncc(cn1)C(=O)NC1(CC1)C(=O)NC1COc2cc(ccc12)-c1cc(Cl)cc(F)c1-c1noc(C)n1