Reaction Details
TargetKininogen-1
LigandBDBM107204
Substrate/Competitorn/a
Meas. Tech.Calcium Mobilization Assay
IC50 5.8±n/a nM
Citation Aebi, JBinggeli, AHertel, CKonkar, AAKuehne, HKuhn, BMaerki, HPWang, H Aryl-benzocycloalkyl amide derivatives US Patent US8592426 Publication Date 11/26/2013
 
Kininogen-1
Name:Kininogen-1
Type:Enzyme
Mol. Mass.:71962.11
Organism:Homo sapiens (Human)
Description:P01042
Residue:644
BDBM107204
NameBDBM107204
Synonyms:US8592426, 54
TypeSmall organic molecule
Emp. Form.C25H27ClFN7O3
Mol. Mass.527.978
SMILESCn1nnc(n1)-c1c(F)cc(Cl)cc1-c1cnc2C(CCc2c1)NC(=O)C1(CC1)NC(=O)OC(C)(C)C