Reaction Details
TargetKininogen-1
LigandBDBM107207
Substrate/Competitorn/a
Meas. Tech.Calcium Mobilization Assay
IC50 0.4±n/a nM
Citation Aebi, JBinggeli, AHertel, CKonkar, AAKuehne, HKuhn, BMaerki, HPWang, H Aryl-benzocycloalkyl amide derivatives US Patent US8592426 Publication Date 11/26/2013
 
Kininogen-1
Name:Kininogen-1
Type:Enzyme
Mol. Mass.:71962.11
Organism:Homo sapiens (Human)
Description:P01042
Residue:644
BDBM107207
NameBDBM107207
Synonyms:US8592426, 57
TypeSmall organic molecule
Emp. Form.C24H20ClFN8O3
Mol. Mass.522.919
SMILESCn1nnc(n1)-c1c(F)cc(Cl)cc1-c1cnc2C(CCc2c1)NC(=O)C1(CC1)NC(=O)c1ccno1