Reaction Details
TargetAcetyl-coenzyme A transporter 1
LigandBDBM47107
Substrate/Competitorn/a
Meas. Tech.Binding Assay
IC50 1.6±n/a nM
Citation Maekawa, TIgawa, H Fused ring compound and use thereof US Patent US8592431 Publication Date 11/26/2013
 
Acetyl-coenzyme A transporter 1
Name:Acetyl-coenzyme A transporter 1
Type:Enzyme
Mol. Mass.:60911.27
Organism:Homo sapiens (Human)
Description:O00400
Residue:549
BDBM47107
NameBDBM47107
Synonyms:US8592431, 155
Typen/a
Emp. Form.C35H42N6O5
Mol. Mass.626.7452
SMILESCCCc1c(Cc2ccc(c(C)c2)-c2ccccc2-c2noc(=O)[nH]2)c(=O)n(C2CCC(CC2)OCC(C)(C)O)c2nc(C)nn12