Reaction Details
TargetAcetyl-coenzyme A transporter 1
LigandBDBM107340
Substrate/Competitorn/a
Meas. Tech.Binding Assay
pH7.4±0
IC50 1.3±0.0 nM
Citation Maekawa, TIgawa, H Fused ring compound and use thereof US Patent US8592431 Publication Date 11/26/2013
 
Acetyl-coenzyme A transporter 1
Name:Acetyl-coenzyme A transporter 1
Type:Enzyme
Mol. Mass.:60911.27
Organism:Homo sapiens (Human)
Description:O00400
Residue:549
BDBM107340
NameBDBM107340
Synonyms:US8592431, 117
TypeSmall organic molecule
Emp. Form.C28H27FN6O4
Mol. Mass.530.5502
SMILESCCCc1c(Cc2ccc(cc2F)-c2ccccc2-c2nc(=O)o[nH]2)c(=O)n(C2CCOCC2)c2ncnn12