Reaction Details
TargetAcetyl-coenzyme A transporter 1
LigandBDBM107347
Substrate/Competitorn/a
Meas. Tech.Binding Assay
pH7.4±0
IC50 0.9±0.0 nM
Citation Maekawa, TIgawa, H Fused ring compound and use thereof US Patent US8592431 Publication Date 11/26/2013
 
Acetyl-coenzyme A transporter 1
Name:Acetyl-coenzyme A transporter 1
Type:Enzyme
Mol. Mass.:60911.27
Organism:Homo sapiens (Human)
Description:O00400
Residue:549
BDBM107347
NameBDBM107347
Synonyms:US8592431, 135
TypeSmall organic molecule
Emp. Form.C30H31FN6O4
Mol. Mass.558.6033
SMILESCCCCc1c(Cc2ccc(cc2F)-c2ccccc2-c2nc(=O)o[nH]2)c(=O)n(C2CCOCC2)c2nc(C)nn12