Reaction Details
TargetAcetyl-coenzyme A transporter 1
LigandBDBM107445
Substrate/Competitorn/a
Meas. Tech.Binding Assay
pH7.4±0
IC50 1.2±0.0 nM
Citation Maekawa, TIgawa, H Fused ring compound and use thereof US Patent US8592431 Publication Date 11/26/2013
 
Acetyl-coenzyme A transporter 1
Name:Acetyl-coenzyme A transporter 1
Type:Enzyme
Mol. Mass.:60911.27
Organism:Homo sapiens (Human)
Description:O00400
Residue:549
BDBM107445
NameBDBM107445
Synonyms:US8592431, 376
TypeSmall organic molecule
Emp. Form.C32H36N6O4
Mol. Mass.568.666
SMILESCCCc1c(Cc2ccc(cc2)-c2ccccc2-c2nc(=O)o[nH]2)c(=O)n(C2CCC(CC2)C(C)(C)O)c2ncnn12