Reaction Details
TargetGag-Pol polyprotein [1148-1435]
LigandBDBM50056898
Substrate/Competitorn/a
Meas. Tech.HIV-1 Integrase Assay
IC50 7e+2±n/a nM
Citation Bhatt, HPatel, PPannecouque, C Discovery of HIV-1 integrase inhibitors: pharmacophore mapping, virtual screening, molecular docking, synthesis, and biological evaluation. Chem Biol Drug Des83:154-66 (2014) 
 
Gag-Pol polyprotein [1148-1435]
Name:Gag-Pol polyprotein [1148-1435]
Type:Enzyme
Mol. Mass.:32171.42
Organism:Human immunodeficiency virus type 1
Description:The sequence encoding the 288-amino-acid wild-type full-length integrase was cloned with an N-terminal 6His tag, and expressed in E. coli.
Residue:288
BDBM50056898
NameBDBM50056898
Synonyms:2-Hydroxy-benzoic acid N'-(2-hydroxy-benzyl)-hydrazide CHEMBL433983
TypeSmall organic molecule
Emp. Form.C14H14N2O3
Mol. Mass.258.2726
SMILESOc1ccccc1CNNC(=O)c1ccccc1O