Reaction Details
TargetKynurenine/alpha-aminoadipate aminotransferase, mitochondrial
LigandBDBM107747
Substrate/Competitorn/a
Meas. Tech.Inhibition Spectra Assay
IC50 22.5±0.0 nM
Citation Dounay, ABMcAllister, LParikh, VDRong, SVerhoest, PR KAT II inhibitors US Patent US8598200 Publication Date 12/3/2013
 
Kynurenine/alpha-aminoadipate aminotransferase, mitochondrial
Name:Kynurenine/alpha-aminoadipate aminotransferase, mitochondrial
Type:Enzyme
Mol. Mass.:47353.09
Organism:Homo sapiens (Human)
Description:Q8N5Z0
Residue:425
BDBM107747
NameBDBM107747
Synonyms:CHEMBL2347115 | US8933095, 4
TypeSmall organic molecule
Emp. Form.C13H14N4O2
Mol. Mass.258.2759
SMILESN[C@H]1Cc2c(cnn2Cc2ccccc2)N(O)C1=O