Reaction Details
TargetCyclin-dependent kinase 4
LigandBDBM107759
Substrate/Competitorn/a
Meas. Tech.Enzymatic Activity Assay
pH7.5±0
IC50 260±n/a nM
Citation Howard, SMortenson, PNHiscock, SDWoolford, AJWoodhead, AJChessari, GO'Reilly, MCongreve, MSDagostin, CCho, YSYang, FChen, CHBrain, CTLagu, BWang, YKim, SGiraldes, JLuzzio, MJPerez, LB Imidazole derivatives and their use as modulators of cyclin dependent kinases US Patent US8598217 Publication Date 12/3/2013
 
Cyclin-dependent kinase 4
Name:Cyclin-dependent kinase 4
Synonyms:Cyclin-dependent kinase 4 (CDK4)
Type:Enzyme
Mol. Mass.:21063.86
Organism:Oryctolagus cuniculus (Rabbit)
Description:Q0GMK6
Residue:189
BDBM107759
NameBDBM107759
Synonyms:US8598217, 169
TypeSmall organic molecule
Emp. Form.C21H22N8O
Mol. Mass.402.4524
SMILESCc1n[nH]c(C)c1-c1cc(ccn1)C(=O)c1nc2nc(ccc2[nH]1)N1CCNCC1