Reaction Details
TargetCyclin-dependent kinase 4
LigandBDBM107761
Substrate/Competitorn/a
Meas. Tech.Enzymatic Activity Assay
pH7.5±0
IC50 5±n/a nM
Citation Howard, SMortenson, PNHiscock, SDWoolford, AJWoodhead, AJChessari, GO'Reilly, MCongreve, MSDagostin, CCho, YSYang, FChen, CHBrain, CTLagu, BWang, YKim, SGiraldes, JLuzzio, MJPerez, LB Imidazole derivatives and their use as modulators of cyclin dependent kinases US Patent US8598217 Publication Date 12/3/2013
 
Cyclin-dependent kinase 4
Name:Cyclin-dependent kinase 4
Synonyms:Cyclin-dependent kinase 4 (CDK4)
Type:Enzyme
Mol. Mass.:21063.86
Organism:Oryctolagus cuniculus (Rabbit)
Description:Q0GMK6
Residue:189
BDBM107761
NameBDBM107761
Synonyms:US8598217, 174
TypeSmall organic molecule
Emp. Form.C17H22N4O3
Mol. Mass.330.3816
SMILESCC(C)(C)OC(=O)N1CCN(CC1)C(=O)c1ccc2nc[nH]c2c1