Reaction Details
TargetTyrosine-protein kinase ABL1
LigandBDBM26474
Substrate/Competitorn/a
Meas. Tech.Z-LYTE biochemical assay
Temperature298.15±n/a K
IC50 6.2e+2±n/a nM
Commentsextracted
Citation Jia, YZhang, JFeng, JXu, FPan, HXu, W Design, synthesis and biological evaluation of pazopanib derivatives as antitumor agents. Chem Biol Drug Des83:306-16 (2014) 
 
Tyrosine-protein kinase ABL1
Name:Tyrosine-protein kinase ABL1
Type:Enzyme
Mol. Mass.:122897.30
Organism:Homo sapiens (Human)
Description:P00519
Residue:1130
BDBM26474
NameBDBM26474
Synonyms:5-({4-[(2,3-dimethyl-2H-indazol-6-yl)(methyl)amino]pyrimidin-2-yl}amino)-2-methylbenzene-1-sulfonamide JMC514632 Compound 13 cid_10113978
TypeSmall organic molecule
Emp. Form.C21H23N7O2S
Mol. Mass.437.518
SMILESCN(c1ccc2c(C)n(C)nc2c1)c1ccnc(Nc2ccc(C)c(c2)S(N)(=O)=O)n1