Reaction Details
TargetSecreted chorismate mutase
LigandBDBM108080
Substrate/Competitorn/a
Meas. Tech.CM Assay
Temperature310.15±n/a K
IC50 5.570e+4± 1.80e+3 nM
Commentsextracted
Citation Jeankumar, VUAlokam, RSridevi, JPSuryadevara, PMatikonda, SSPeddi, SSahithi, SAlvala, MYogeeswari, PSriram, D Discovery and Structure Optimization of a Series of Isatin Derivatives as Mycobacterium tuberculosis Chorismate Mutase Inhibitors. Chem Biol Drug Des83:498-506 (2014) 
 
Secreted chorismate mutase
Name:Secreted chorismate mutase
Type:Protein
Mol. Mass.:21942.03
Organism:Mycobacterium tuberculosis H37Rv
Description:n/a
Residue:199
BDBM108080
NameBDBM108080
Synonyms:5‐{4‐[3‐(trifluoromethyl)phenyl]piperazin‐1‐yl}‐1H‐ indole‐2,3‐dione (Compound 21)
TypeSmall organic molecule
Emp. Form.C19H16F3N3O2
Mol. Mass.375.3444
SMILESFC(F)(F)c1cccc(c1)N1CCN(CC1)c1ccc2NC(=O)C(=O)c2c1