Reaction Details
TargetSecreted chorismate mutase
LigandBDBM108081
Substrate/Competitorn/a
Meas. Tech.CM Assay
Temperature310.15±n/a K
IC50 2.560e+4± 1.50e+3 nM
Commentsextracted
Citation Jeankumar, VUAlokam, RSridevi, JPSuryadevara, PMatikonda, SSPeddi, SSahithi, SAlvala, MYogeeswari, PSriram, D Discovery and Structure Optimization of a Series of Isatin Derivatives as Mycobacterium tuberculosis Chorismate Mutase Inhibitors. Chem Biol Drug Des83:498-506 (2014) 
 
Secreted chorismate mutase
Name:Secreted chorismate mutase
Type:Protein
Mol. Mass.:21942.03
Organism:Mycobacterium tuberculosis H37Rv
Description:n/a
Residue:199
BDBM108081
NameBDBM108081
Synonyms:5‐(piperidin‐1‐yl)‐1H‐indole‐2,3‐dione (Compound 22)
TypeSmall organic molecule
Emp. Form.C13H14N2O2
Mol. Mass.230.2625
SMILESO=C1Nc2ccc(cc2C1=O)N1CCCCC1