Reaction Details
TargetPlasma kallikrein
LigandBDBM108117
Substrate/Competitorn/a
Meas. Tech.Inhibition Assay
Ki 2.7±0.0 nM
Citation Herold, PDaghish, MJelakovic, SLudwig, FReichelt, CSchulze, ASchweinitz, A Trypsin-like serine protease inhibitors, and their preparation and use US Patent US8598206 Publication Date 12/3/2013
 
Plasma kallikrein
Name:Plasma kallikrein
Type:Protein
Mol. Mass.:71391.16
Organism:Homo sapiens (Human)
Description:P03952
Residue:638
BDBM108117
NameBDBM108117
Synonyms:US8598206, Table 6, 2
TypeSmall organic molecule
Emp. Form.C34H45N7O4S
Mol. Mass.647.831
SMILESNC(=N)c1ccc(CNC(=O)[C@H](CCC2CCNCC2)NC(=O)[C@@H](CCCc2ccncc2)NS(=O)(=O)Cc2ccccc2)cc1