Reaction Details
TargetComplement C1s subcomponent
LigandBDBM108108
Substrate/Competitorn/a
Meas. Tech.Inhibition Assay
Ki 10000±0.0 nM
Citation Herold, PDaghish, MJelakovic, SLudwig, FReichelt, CSchulze, ASchweinitz, A Trypsin-like serine protease inhibitors, and their preparation and use US Patent US8598206 Publication Date 12/3/2013
 
Complement C1s subcomponent
Name:Complement C1s subcomponent
Type:Protein
Mol. Mass.:76657.91
Organism:Homo sapiens (Human)
Description:P09871
Residue:688
BDBM108108
NameBDBM108108
Synonyms:US8598206, 117 | US8598206, 123
TypeSmall organic molecule
Emp. Form.C34H46N7O5S
Mol. Mass.664.838
SMILESNC(=N)c1ccc(CNC(=O)[C@H](CCC2CCNCC2)NC(=O)[C@@H](CCCC2=CC=[N](O)C=C2)NS(=O)(=O)Cc2ccccc2)cc1