Reaction Details
TargetComplement C1s subcomponent
LigandBDBM108112
Substrate/Competitorn/a
Meas. Tech.Inhibition Assay
Ki 4200±0.0 nM
Citation Herold, PDaghish, MJelakovic, SLudwig, FReichelt, CSchulze, ASchweinitz, A Trypsin-like serine protease inhibitors, and their preparation and use US Patent US8598206 Publication Date 12/3/2013
 
Complement C1s subcomponent
Name:Complement C1s subcomponent
Type:Protein
Mol. Mass.:76657.91
Organism:Homo sapiens (Human)
Description:P09871
Residue:688
BDBM108112
NameBDBM108112
Synonyms:US8598206, Table 6, 21
TypeSmall organic molecule
Emp. Form.C33H44N7O5S
Mol. Mass.650.811
SMILESNC(=N)c1ccc(CNC(=O)[C@H](CCC2CCNCC2)NC(=O)[C@@H](CCC2=CC=[N](O)C=C2)NS(=O)(=O)Cc2ccccc2)cc1