Reaction Details
TargetComplement C1r subcomponent
LigandBDBM108115
Substrate/Competitorn/a
Meas. Tech.Inhibition Assay
Ki>100000±0.0 nM
Citation Herold, PDaghish, MJelakovic, SLudwig, FReichelt, CSchulze, ASchweinitz, A Trypsin-like serine protease inhibitors, and their preparation and use US Patent US8598206 Publication Date 12/3/2013
 
Complement C1r subcomponent
Name:Complement C1r subcomponent
Type:Enzyme
Mol. Mass.:80113.65
Organism:Homo sapiens (Human)
Description:P00736
Residue:705
BDBM108115
NameBDBM108115
Synonyms:US8598206, Table 6, 24
TypeSmall organic molecule
Emp. Form.C36H53N7O6S
Mol. Mass.711.914
SMILESCOC(=O)N1CCC(CCC[C@@H](NS(=O)(=O)Cc2ccccc2)C(=O)N[C@@H](CCC2CCNCC2)C(=O)NCc2ccc(cc2)C(N)=N)CC1