Reaction Details
TargetTranscription initiation factor IIA subunit 1
LigandBDBM47177
Substrate/Competitorn/a
Meas. Tech.Inhibition Assay
Ki 3800±0.0 nM
Citation Herold, PDaghish, MJelakovic, SLudwig, FReichelt, CSchulze, ASchweinitz, A Trypsin-like serine protease inhibitors, and their preparation and use US Patent US8598206 Publication Date 12/3/2013
 
Transcription initiation factor IIA subunit 1
Name:Transcription initiation factor IIA subunit 1
Type:Enzyme
Mol. Mass.:41485.12
Organism:Homo sapiens (Human)
Description:P52655
Residue:376
BDBM47177
NameBDBM47177
Synonyms:BDBM108100 | US8598206, Table 6, 9
Typen/a
Emp. Form.C36H53N7O5S
Mol. Mass.695.915
SMILESCC(=O)N1CCC(CCC[C@@H](NS(=O)(=O)Cc2ccccc2)C(=O)N[C@@H](CCC2CCNCC2)C(=O)NCc2ccc(cc2)C(N)=N)CC1